Reaction Details
TargetPeriod circadian protein homolog 2
LigandBDBM50140886
Substrate/Competitorn/a
Meas. Tech.High-Throughput Circadian Assay
EC50 8273±n/a nM
Citation Bersot, RHumphries, P Carbazole-containing sulfonamides as cryptochrome modulators US Patent US10383880 Publication Date 8/20/2019
 
Period circadian protein homolog 2
Name:Period circadian protein homolog 2
Type:PROTEIN
Mol. Mass.:136576.47
Organism:Homo sapiens (Human)
Description:ChEMBL_116705
Residue:1255
BDBM50140886
NameBDBM50140886
Synonyms:CHEMBL3753460 | US10383880, Example 44
TypeSmall organic molecule
Emp. Form.C23H24N2O3S
Mol. Mass.408.513
SMILESCS(=O)(=O)N(CC(O)Cn1c2ccccc2c2ccccc12)Cc1ccccc1