Reaction Details
TargetMitogen-activated protein kinase kinase kinase 7
LigandBDBM50129129
Substrate/Competitorn/a
Meas. Tech.TaK1-TaB1 Inhibitor Assays
IC50 360±n/a nM
Citation Croatt, MPFakhouri, LOberlies, NHPearce, C Non-aromatic difluoro analogues of resorcylic acid lactones US Patent US10434085 Publication Date 10/8/2019
 
Mitogen-activated protein kinase kinase kinase 7
Name:Mitogen-activated protein kinase kinase kinase 7
Type:Protein
Mol. Mass.:67199.89
Organism:Homo sapiens (Human)
Description:O43318
Residue:606
BDBM50129129
NameBDBM50129129
Synonyms:CHEMBL3629242 | US10434085, Compound 7
TypeSmall organic molecule
Emp. Form.C19H21BrO7
Mol. Mass.441.27
SMILESCOc1cc(O)c2c(\C=C\C[C@H](O)[C@H](O)C(=O)\C=C/C[C@H](C)OC2=O)c1Br