Reaction Details
TargetGuanylate cyclase soluble subunit alpha-1/beta-1
LigandBDBM280870
Substrate/Competitorn/a
Meas. Tech.Binding Assay
Ki 0.062±n/a nM
Citation Berger, RChen, YLi, GGarfunkle, JLi, HMiao, SRaghavan, SSmith, CJStelmach, JWhitehead, AZhang, RZhang, YFu, JJi, GJiang, F Soluble guanylate cyclase stimulators US Patent US10428076 Publication Date 10/1/2019
 
Guanylate cyclase soluble subunit alpha-1/beta-1
Name:Guanylate cyclase soluble subunit alpha-1/beta-1
Type:Enzyme
Mol. Mass.:n/a
Description:n/a
Components:This complex has 2 components.
Component 1
Name:Guanylate cyclase soluble subunit alpha-1
Synonyms:GCS-alpha-1 GCYA1_HUMAN GUCSA3 GUCY1A3 Guanylate cyclase soluble subunit alpha-3 Solube guanylate cyclase alpha-1 (sGCalpha) | soluble guanylate cyclase alpha-1 (sGC)
Type:Enzyme
Mol. Mass.:77457.21
Organism:Homo sapiens (Human)
Description:Q02108
Residue:690
Component 2
Name:Guanylate cyclase soluble subunit beta-1
Synonyms:GCYB1_HUMAN GUCSB3 GUCY1B3 Solube guanylate cyclase beta-1 (sGCβ1) | soluble guanylate cyclase beta-1 (sGC)
Type:Enzyme
Mol. Mass.:70496.05
Organism:Homo sapiens (Human)
Description:Q02153
Residue:619
BDBM280870
NameBDBM280870
Synonyms:4-(2-{4-amino-2- [1-(2-fluorobenzyl)- 1H-pyrazolo[3,4-b] pyridin-3-yl]-5- methyl-6-oxo-6,7- dihydro-5H-pyrrolo [2,3-d]pyrimidin- 5-yl}-1,3-oxazol-4- yl)benzoic acid US10428076, Example 146A
TypeSmall organic molecule
Emp. Form.C30H21FN8O4
Mol. Mass.576.5373
SMILESCC1(C(=O)Nc2nc(nc(N)c12)-c1nn(Cc2ccccc2F)c2ncccc12)c1nc(co1)-c1ccc(cc1)C(O)=O