Reaction Details
TargetMucosa-associated lymphoid tissue lymphoma translocation protein 1 [329-824]
LigandBDBM355889
Substrate/Competitorn/a
Meas. Tech.Biochemical Assay
IC50 0.002±n/a nM
Citation Soldermann, CPQuancard, JSchlapbach, ASimic, OTintelnot-Blomley, MZoller, T Pyrazolo pyrimidine derivatives and their use as MALT1 inhbitors US Patent US10442808 Publication Date 10/15/2019
 
Mucosa-associated lymphoid tissue lymphoma translocation protein 1 [329-824]
Name:Mucosa-associated lymphoid tissue lymphoma translocation protein 1 [329-824]
Type:Enzyme Catalytic Domain
Mol. Mass.:55563.19
Organism:Homo sapiens (Human)
Description:amino acids 329-824
Residue:495
BDBM355889
NameBDBM355889
Synonyms:(S)-methyl 3-chloro- 5-(3-(2-chloro-7-(1- methoxyethyl)pyrazo- lo[1,5-a]pyrimidin-6- yl)ureido)benzoate US9815842, Example 13
TypeSmall organic molecule
Emp. Form.C18H17Cl2N5O4
Mol. Mass.438.265
SMILESCO[C@@H](C)c1c(NC(=O)Nc2cc(Cl)cc(c2)C(=O)OC)cnc2cc(Cl)nn12