Reaction Details
TargetPhosphatidylinositol 3-kinase regulatory subunit beta
LigandBDBM50434806
Substrate/Competitorn/a
Meas. Tech.p110alpha (Alpha) PI3K Binding Assay
Ki 53.0±n/a nM
Citation Braun, MHanan, EStaben, STHeald, RAMacLeod, CElliott, R Benzoxazepin oxazolidinone compounds and methods of use US Patent US10112932 Publication Date 10/30/2018
 
Phosphatidylinositol 3-kinase regulatory subunit beta
Name:Phosphatidylinositol 3-kinase regulatory subunit beta
Type:Enzyme Subunit
Mol. Mass.:81542.75
Organism:Homo sapiens (Human)
Description:O00459
Residue:728
BDBM50434806
NameBDBM50434806
Synonyms:2-(4-(2-(1-isopropyl-3-methyl-1H-1,2,4-triazol-5-yl)-5,6-dihydrobenzo[f]imidazo[1,2-d][1,4]oxazepin-9-yl)-1H-pyrazol-1-yl)-2-methylpropanamide GDC 0032 Roche RG7604 US10851091, Compound taselisib | US8242104, Compound 196
TypeSmall organic molecule
Emp. Form.C24H28N8O2
Mol. Mass.460.5315
SMILESCC(C)n1nc(C)nc1-c1cn2CCOc3cc(ccc3-c2n1)-c1cnn(c1)C(C)(C)C(N)=O