Reaction Details
TargetPhosphatidylinositol 3-kinase regulatory subunit beta
LigandBDBM295665
Substrate/Competitorn/a
Meas. Tech.p110alpha (Alpha) PI3K Binding Assay
Ki 99.7±n/a nM
Citation Braun, MHanan, EStaben, STHeald, RAMacLeod, CElliott, R Benzoxazepin oxazolidinone compounds and methods of use US Patent US10112932 Publication Date 10/30/2018
 
Phosphatidylinositol 3-kinase regulatory subunit beta
Name:Phosphatidylinositol 3-kinase regulatory subunit beta
Type:Enzyme Subunit
Mol. Mass.:81542.75
Organism:Homo sapiens (Human)
Description:O00459
Residue:728
BDBM295665
NameBDBM295665
Synonyms:(S)-2-((2-((S)-4-(difluoromethyl)- 2-oxooxazolidin-3-yl)-5,6- dihydrobenzo[f]imidazo[1,2- d][1,4]oxazepin-9- yl)amino)propanamide US10851091, Compound 101
TypeSmall organic molecule
Emp. Form.C18H19F2N5O4
Mol. Mass.407.3714
SMILESC[C@H](Nc1ccc2-c3nc(cn3CCOc2c1)N1[C@@H](COC1=O)C(F)F)C(N)=O