Reaction Details
TargetPhosphatidylinositol 3-kinase regulatory subunit alpha
LigandBDBM295676
Substrate/Competitorn/a
Meas. Tech.p110alpha (Alpha) PI3K Binding Assay
Ki 0.186±n/a nM
Citation Braun, MHanan, EStaben, STHeald, RAMacLeod, CElliott, R Benzoxazepin oxazolidinone compounds and methods of use US Patent US10112932 Publication Date 10/30/2018
 
Phosphatidylinositol 3-kinase regulatory subunit alpha
Name:Phosphatidylinositol 3-kinase regulatory subunit alpha
Type:Protein
Mol. Mass.:83592.82
Organism:Homo sapiens (Human)
Description:P27986
Residue:724
BDBM295676
NameBDBM295676
Synonyms:US10851091, U.S. Pat. No. 8,242,104 No. 486 | US8242104, Compound 486
TypeSmall organic molecule
Emp. Form.C18H17F3N6O3
Mol. Mass.422.3612
SMILESC[C@H](Oc1ccc2-c3nc(cn3CCOc2c1)-c1ncnn1CC(F)(F)F)C(N)=O