Reaction Details
TargetHepatocyte growth factor receptor
LigandBDBM98030
Substrate/Competitorn/a
Meas. Tech.Kinase Enzyme Assays
IC50 0.550±0 nM
Citation Zhuo, JHe, CYao, W Imidazo[1,2-B][1,2,4]triazines as c-Met inhibitors US Patent US10472367 Publication Date 11/12/2019
 
Hepatocyte growth factor receptor
Name:Hepatocyte growth factor receptor
Type:Protein
Mol. Mass.:155559.73
Organism:Homo sapiens (Human)
Description:P08581
Residue:1390
BDBM98030
NameBDBM98030
Synonyms:US10472367, Compound Formula IV US8487096, IV | US9221824, Formula IV
TypeSmall organic molecule
Emp. Form.C22H17N7O
Mol. Mass.395.4167
SMILESCNC(=O)c1ccc(cn1)-c1cnc2ncc(Cc3ccc4ncccc4c3)n2n1