Reaction Details
TargetIsoform 2 of MAP kinase-interacting serine/threonine-protein kinase 1 (MNK1a) 344D]
LigandBDBM420196
Substrate/Competitorn/a
Meas. Tech.MKNK1 Kinase High ATP Assay
IC50 3.00±n/a nM
Citation Giese, AKlar, UGraham, KKettschau, GSülzle, DLienau, PPetersen, KLeFranc, JSchmidt, N Pyrazolopyridinamines as MKNK1 and MKNK2 inhibitors US Patent US10487092 Publication Date 11/26/2019
 
Isoform 2 of MAP kinase-interacting serine/threonine-protein kinase 1 (MNK1a) 344D]
Name:Isoform 2 of MAP kinase-interacting serine/threonine-protein kinase 1 (MNK1a) 344D]
Type:Protein
Mol. Mass.:47416.00
Organism:Homo sapiens (Human)
Description:Q9BUB5-2 with T344D
Residue:424
BDBM420196
NameBDBM420196
Synonyms:(7S)—N-[2-(Dimethylamino)ethyl]-4-[(6-methoxypyrazolo[1,5-a]pyridin-5-yl)amino]-5,6,7,8-tetrahydro[1]benzothieno[2,3-d]pyrimidine-7-carboxamide | US10487092, Example 82
TypeSmall organic molecule
Emp. Form.C22H26N8O2S
Mol. Mass.466.559
SMILESCOc1cn2nccc2nc1Nc1ncnc2sc3C[C@H](CCc3c12)C(=O)NCCN(C)C