Reaction Details
TargetReplicase polyprotein 1ab
LigandBDBM50062648
Substrate/Competitorn/a
Meas. Tech.3CLpro enzyme assay
IC50 28850±n/a nM
Citation Zhu, WXu, MChen, CZGuo, HShen, MHu, XShinn, PKlumpp-Thomas, CMichael, SGZheng, W Identification of SARS-CoV-2 3CL Protease Inhibitors by a Quantitative High-throughput Screening. bioRxiv0:0 (2020) 
 
Replicase polyprotein 1ab
Name:Replicase polyprotein 1ab
Type:Protein
Mol. Mass.:794070.71
Organism:2019-nCoV
Description:P0DTD1
Residue:7096
BDBM50062648
NameBDBM50062648
Synonyms:2-Chloro-4-trifluoromethyl-pyrimidine-5-carboxylic acid (3,5-bis-trifluoromethyl-phenyl)-amide SP 100030
TypeSmall organic molecule
Emp. Form.C14H5ClF9N3O
Mol. Mass.437.648
SMILESFC(F)(F)c1cc(NC(=O)c2cnc(Cl)nc2C(F)(F)F)cc(c1)C(F)(F)F