Reaction Details
TargetToll-like receptor 8
LigandBDBM273316
Substrate/Competitorn/a
Meas. Tech.Biological Assay
IC50 3.40±n/a nM
Citation Dyckman, AJDodd, DSMussari, CPPasunoori, LKumar, SR [1,2,4]triazolo[1,5-a]pyridinyl substituted indole compounds US Patent US10478424 Publication Date 11/19/2019
 
Toll-like receptor 8
Name:Toll-like receptor 8
Type:Enzyme
Mol. Mass.:119828.77
Organism:Homo sapiens (Human)
Description:Q9NR97
Residue:1041
BDBM273316
NameBDBM273316
Synonyms:US10071079, Example 90 | US10478424, Example 90
TypeSmall organic molecule
Emp. Form.C29H36N6O
Mol. Mass.484.6357
SMILESCC(C)c1c([nH]c2ccc(cc12)C1CCN(CC(=O)N2CCCC2)CC1)-c1cc(C)c2ncnn2c1