Reaction Details
TargetToll-like receptor 7
LigandBDBM273608
Substrate/Competitorn/a
Meas. Tech.Biological Assay
IC50 0.400±n/a nM
Citation Dyckman, AJDodd, DSMussari, CPPasunoori, LKumar, SR [1,2,4]triazolo[1,5-a]pyridinyl substituted indole compounds US Patent US10478424 Publication Date 11/19/2019
 
Toll-like receptor 7
Name:Toll-like receptor 7
Type:Enzyme
Mol. Mass.:120945.35
Organism:Homo sapiens (Human)
Description:Q9NYK1
Residue:1049
BDBM273608
NameBDBM273608
Synonyms:US10071079, Example 393 US10071079, Example 541 | US10478424, Example 393
TypeSmall organic molecule
Emp. Form.C27H33N5O
Mol. Mass.443.5838
SMILESCC(C)c1c([nH]c2ccc(cc12)C1CCN(CC1)C1CCOC1)-c1cc(C)c2ncnn2c1