Reaction Details
TargetDual specificity protein kinase TTK
LigandBDBM241228
Substrate/Competitorn/a
Meas. Tech.Inhibition Kinase Assay
IC50 61.0±n/a nM
Citation Hoelder, SBlagg, JSolanki, SWoodward, HNaud, SBavetsias, VSheldrake, PInnocenti, PCheung, KJAtrash, B Compounds that inhibit MPS1 kinase US Patent US10479788 Publication Date 11/19/2019
 
Dual specificity protein kinase TTK
Name:Dual specificity protein kinase TTK
Type:Protein
Mol. Mass.:97086.79
Organism:Homo sapiens (Human)
Description:P33981
Residue:857
BDBM241228
NameBDBM241228
Synonyms:US10479788, Example 70 US9409907, 70
TypeSmall organic molecule
Emp. Form.C25H29N7O
Mol. Mass.443.5441
SMILESCOc1cc(ccc1Nc1ncc2ccnc(NCC3CCCCC3)c2n1)-c1cnn(C)c1