Reaction Details
TargetGlycogen synthase kinase-3 beta
LigandBDBM385209
Substrate/Competitorn/a
Meas. Tech.The screening assay for GSK3beta kinase activity
EC50 1.000±n/a nM
Citation KC, SKMittapalli, GKHofilena, BJMarakovits, JTChiruta, CMak, CCCao, J Isoquinolin-3-yl carboxamides and preparation and use thereof US Patent US10508099 Publication Date 12/17/2019
 
Glycogen synthase kinase-3 beta
Name:Glycogen synthase kinase-3 beta
Type:Enzyme
Mol. Mass.:46756.38
Organism:Homo sapiens (Human)
Description:P49841
Residue:420
BDBM385209
NameBDBM385209
Synonyms:US10287267, Compound 433 US10556885, Compound 433 US11673881, Compound 433
TypeSmall organic molecule
Emp. Form.C16H15N5O
Mol. Mass.293.3232
SMILESCn1cc(nn1)-c1ccc2cnc(NC(=O)C3CC3)cc2c1