Reaction Details
TargetCalmodulin-domain protein kinase 1
LigandBDBM50389687
Substrate/Competitorn/a
Meas. Tech.luminescent kinase assay
IC50 0.600±n/a nM
Citation Van Voorhis, WCHol, WGLarson, ETMaly, DJMerritt, EOjo, KK Compositions and methods for treating toxoplasmosis, cryptosporidiosis, and other apicomplexan protozoan related diseases US Patent US10544104 Publication Date 1/28/2020
 
Calmodulin-domain protein kinase 1
Name:Calmodulin-domain protein kinase 1
Type:Enzyme Catalytic Domain
Mol. Mass.:57248.42
Organism:Toxoplasma gondii
Description:n/a
Residue:507
BDBM50389687
NameBDBM50389687
Synonyms:CHEMBL2070054 US11247972, Compound 41 | US9765037, Compound 41
TypeSmall organic molecule
Emp. Form.C21H21N5O
Mol. Mass.359.4243
SMILESCC(C)n1nc(-c2ccc3cc(OCC=C)ccc3c2)c2c(N)ncnc12