Reaction Details
TargetAP2-associated protein kinase 1
LigandBDBM311292
Substrate/Competitorn/a
Meas. Tech.AAK1 Kinase Assay
IC50 0.340±n/a nM
Citation Bronson, JJChen, LDitta, JLDzierba, CDJalagam, PRLuo, GMacor, JEMaishal, TKNara, SJRajamani, RSistla, RKThangavel, S Biaryl kinase inhibitors US Patent US10544120 Publication Date 1/28/2020
 
AP2-associated protein kinase 1
Name:AP2-associated protein kinase 1
Type:PROTEIN
Mol. Mass.:103884.23
Organism:Homo sapiens (Human)
Description:ChEMBL_774569
Residue:961
BDBM311292
NameBDBM311292
Synonyms:(S)-1-((4-(difluoromethyl)-5′-fluoro-2′-methyl-[2,4′-bipyridin]-5-yl)oxy)-2,4-dimethylpentan-2-amine US10351563, Example 148 US10723734, Example 148 US9902722, Example 148
TypeSmall organic molecule
Emp. Form.C19H24F3N3O
Mol. Mass.367.4086
SMILESCC(C)C[C@](C)(N)COc1cnc(cc1C(F)F)-c1cc(C)ncc1F