Reaction Details
TargetGlycogen synthase kinase-3 beta
LigandBDBM293490
Substrate/Competitorn/a
Meas. Tech.The GSK3beta kinase assay
EC50 2.00±n/a nM
Citation KC, SKMak, CCEastman, BWCao, JBollu, VMittapalli, GKChiruta, C Isoquinolin-3-yl carboxamides and preparation and use thereof US Patent US10544128 Publication Date 1/28/2020
 
Glycogen synthase kinase-3 beta
Name:Glycogen synthase kinase-3 beta
Type:Enzyme
Mol. Mass.:46756.38
Organism:Homo sapiens (Human)
Description:P49841
Residue:420
BDBM293490
NameBDBM293490
Synonyms:US10106527, Compound 106 US11548872, Compound 106 US9951048, Compound 106
TypeSmall organic molecule
Emp. Form.C21H19N5O
Mol. Mass.357.4085
SMILESCn1cc(cn1)-c1ccc2cnc(NC(=O)CCc3cccnc3)cc2c1