Reaction Details
TargetGlycogen synthase kinase-3 beta
LigandBDBM293647
Substrate/Competitorn/a
Meas. Tech.The GSK3beta kinase assay
EC50 3.00±n/a nM
Citation KC, SKMak, CCEastman, BWCao, JBollu, VMittapalli, GKChiruta, C Isoquinolin-3-yl carboxamides and preparation and use thereof US Patent US10544128 Publication Date 1/28/2020
 
Glycogen synthase kinase-3 beta
Name:Glycogen synthase kinase-3 beta
Type:Enzyme
Mol. Mass.:46756.38
Organism:Homo sapiens (Human)
Description:P49841
Residue:420
BDBM293647
NameBDBM293647
Synonyms:US10106527, Compound 445 US11548872, Compound 445 US9951048, Compound 445
TypeSmall organic molecule
Emp. Form.C24H26N8O
Mol. Mass.442.5162
SMILESCN1CCN(CC1)c1cc(CC(=O)Nc2cc3cc(ccc3cn2)-c2cn(C)nn2)ccn1