Reaction Details
TargetToll-like receptor 7
LigandBDBM427884
Substrate/Competitorn/a
Meas. Tech.TLR7/8/9 Inhibition Reporter Assays
IC50 0.170±n/a nM
Citation Dyckman, AJDodd, DSMussari, CPKumar, SR 4-azaindole compounds US Patent US10544143 Publication Date 1/28/2020
 
Toll-like receptor 7
Name:Toll-like receptor 7
Type:Enzyme
Mol. Mass.:120945.35
Organism:Homo sapiens (Human)
Description:Q9NYK1
Residue:1049
BDBM427884
NameBDBM427884
Synonyms:US10544143, Example 318 US10730877, Example 323 | US11053244, Example 323
TypeSmall organic molecule
Emp. Form.C24H30N6O
Mol. Mass.418.5346
SMILESCOc1cc(cn2ncnc12)-c1[nH]c2cc(C)c(nc2c1C(C)C)C1CCC(N)CC1