Reaction Details
TargetToll-like receptor 7
LigandBDBM427907
Substrate/Competitorn/a
Meas. Tech.TLR7/8/9 Inhibition Reporter Assays
IC50 0.120±n/a nM
Citation Dyckman, AJDodd, DSMussari, CPKumar, SR 4-azaindole compounds US Patent US10544143 Publication Date 1/28/2020
 
Toll-like receptor 7
Name:Toll-like receptor 7
Type:Enzyme
Mol. Mass.:120945.35
Organism:Homo sapiens (Human)
Description:Q9NYK1
Residue:1049
BDBM427907
NameBDBM427907
Synonyms:US10544143, Example 341 US10730877, Example 342 | US11053244, Example 342
TypeSmall organic molecule
Emp. Form.C28H35FN6O2
Mol. Mass.506.6149
SMILESCOc1cc(cn2ncnc12)-c1[nH]c2cc(F)c(nc2c1C(C)C)C1CCC(CC1)NCC1(C)COC1