Reaction Details
TargetToll-like receptor 8
LigandBDBM428448
Substrate/Competitorn/a
Meas. Tech.TLR7/8/9 Inhibition Reporter Assays
IC50 0.170±n/a nM
Citation Dyckman, AJDodd, DSMussari, CPKumar, SR 4-azaindole compounds US Patent US10544143 Publication Date 1/28/2020
 
Toll-like receptor 8
Name:Toll-like receptor 8
Type:Enzyme
Mol. Mass.:119828.77
Organism:Homo sapiens (Human)
Description:Q9NR97
Residue:1041
BDBM428448
NameBDBM428448
Synonyms:US10544143, Example 884 US11053244, Example 884
TypeSmall organic molecule
Emp. Form.C24H31N7
Mol. Mass.417.5498
SMILESCC(C)c1c([nH]c2ccc(nc12)N1C[C@@H](C)N[C@H](C)C1)-c1cn2ncnc2c(C)c1C