Reaction Details
TargetReplicase polyprotein 1ab
LigandBDBM429298
Substrate/Competitorn/a
Meas. Tech.No assay is provided
IC50 14±n/a nM
Citation Pillaiyar, TManickam, MNamasivayam, VHayashi, YJung, SH An Overview of Severe Acute Respiratory Syndrome-Coronavirus (SARS-CoV) 3CL Protease Inhibitors: Peptidomimetics and Small Molecule Chemotherapy. J Med Chem59:6595-628 (2016) 
 
Replicase polyprotein 1ab
Name:Replicase polyprotein 1ab
Type:Protein
Mol. Mass.:790250.81
Organism:Human SARS coronavirus (SARS-CoV) (Severe acute respiratory syndrome coronavirus)
Description:P0C6X7
Residue:7073
BDBM429298
NameBDBM429298
Synonyms:jm5b01461, Compound 118
TypeSmall Organic Molecule
Emp. Form.C16H9FN4O3
Mol. Mass.324.2661
SMILESFc1ccc2cc([nH]c2c1)C(=O)C(=O)On1nnc2ccccc12