Reaction Details
TargetProcathepsin L
LigandBDBM23866
Substrate/Competitorn/a
Meas. Tech.No assay is provided
EC50 100±n/a nM
Citation Pillaiyar, TWendt, LLManickam, MEaswaran, M The recent outbreaks of human coronaviruses: A medicinal chemistry perspective. Med Res Rev0:0 (2020) 
 
Procathepsin L
Name:Procathepsin L
Type:Enzyme
Mol. Mass.:37557.19
Organism:Homo sapiens (Human)
Description:Purchased from Calbiochem (San Diego, CA).
Residue:333
BDBM23866
NameBDBM23866
Synonyms:MDL28170 benzyl N-[(1S)-2-methyl-1-[(1-oxo-3-phenylpropan-2-yl)carbamoyl]propyl]carbamate med.21724, Compound 20
TypeSmall organic molecule
Emp. Form.C22H26N2O4
Mol. Mass.382.4528
SMILESCC(C)C(NC(=O)OCc1ccccc1)C(=O)NC(Cc1ccccc1)C=O