Reaction Details
TargetProcathepsin L
LigandBDBM429284
Substrate/Competitorn/a
Meas. Tech.No assay is provided
EC50 193±n/a nM
Citation Pillaiyar, TWendt, LLManickam, MEaswaran, M The recent outbreaks of human coronaviruses: A medicinal chemistry perspective. Med Res Rev0:0 (2020) 
 
Procathepsin L
Name:Procathepsin L
Type:Enzyme
Mol. Mass.:37557.19
Organism:Homo sapiens (Human)
Description:Purchased from Calbiochem (San Diego, CA).
Residue:333
BDBM429284
NameBDBM429284
Synonyms:med.21724, Compound 22
TypeSmall Organic Molecule
Emp. Form.C28H33N5O6
Mol. Mass.535.5915
SMILESCC(C)(C)OC(=O)NC(Cc1c[nH]c2ccccc12)C(=O)NNC(=O)OCC(=O)N1CCCc2ccccc12