Reaction Details
TargetProcathepsin L
LigandBDBM11318
Substrate/Competitorn/a
Meas. Tech.No assay is provided
EC50 200000±n/a nM
Citation Pillaiyar, TWendt, LLManickam, MEaswaran, M The recent outbreaks of human coronaviruses: A medicinal chemistry perspective. Med Res Rev0:0 (2020) 
 
Procathepsin L
Name:Procathepsin L
Type:Enzyme
Mol. Mass.:37557.19
Organism:Homo sapiens (Human)
Description:Purchased from Calbiochem (San Diego, CA).
Residue:333
BDBM11318
NameBDBM11318
Synonyms:1,3,8-trihydroxy-6-methyl-9,10-dihydroanthracene-9,10-dione CHEMBL289277 US20230364057, Compound 242 | med.21724, Compound 24
TypeSmall organic molecule
Emp. Form.C15H10O5
Mol. Mass.270.2369
SMILESCc1cc(O)c2C(=O)c3c(O)cc(O)cc3C(=O)c2c1