Reaction Details
TargetProcathepsin L
LigandBDBM429290
Substrate/Competitorn/a
Meas. Tech.No assay is provided
EC50 1600±n/a nM
Citation Pillaiyar, TWendt, LLManickam, MEaswaran, M The recent outbreaks of human coronaviruses: A medicinal chemistry perspective. Med Res Rev0:0 (2020) 
 
Procathepsin L
Name:Procathepsin L
Type:Enzyme
Mol. Mass.:37557.19
Organism:Homo sapiens (Human)
Description:Purchased from Calbiochem (San Diego, CA).
Residue:333
BDBM429290
NameBDBM429290
Synonyms:med.21724, Compound 26
TypeSmall Organic Molecule
Emp. Form.C22H36N2O4
Mol. Mass.392.5322
SMILESOC(COc1cccc(OCC(O)CN2CCCCC2)c1)CN1CCCCC1