Reaction Details
TargetNeuroepithelial cell-transforming gene 1 protein
LigandBDBM50337822
Substrate/Competitorn/a
Meas. Tech.Functional Uptake Assay (hNET)
IC50 790±n/a nM
Citation Shao, LWang, FMalcolm, SCHewitt, MCBush, LRMa, JVarney, MACampbell, UEngel, SRHardy, LWKoch, PCampell, JE Cycloalkylamines as monoamine reuptake inhibitors US Patent US10562878 Publication Date 2/18/2020
 
Neuroepithelial cell-transforming gene 1 protein
Name:Neuroepithelial cell-transforming gene 1 protein
Type:PROTEIN
Mol. Mass.:67762.41
Organism:Homo sapiens
Description:ChEMBL_118125
Residue:596
BDBM50337822
NameBDBM50337822
Synonyms:4-((1-(3,4-dichlorophenyl)cyclohexyl)methyl)morpholine US10562878, Compound 110
TypeSmall organic molecule
Emp. Form.C17H23Cl2NO
Mol. Mass.328.277
SMILESClc1ccc(cc1Cl)C1(CN2CCOCC2)CCCCC1