Reaction Details
TargetMetabotropic glutamate receptor 5
LigandBDBM50113480
Substrate/Competitorn/a
Meas. Tech.[3H]-M-MPEP Radioligand Binding Assay
Ki 9.77±n/a nM
Citation Christopher, JACongreve, MSAves, SJTehan, BG 4-(3-cyanophenyl)-6-pyridinylpyrimidine mGlu5 modulators US Patent US10584111 Publication Date 3/10/2020
 
Metabotropic glutamate receptor 5
Name:Metabotropic glutamate receptor 5
Type:Enzyme
Mol. Mass.:132484.72
Organism:Homo sapiens (Human)
Description:n/a
Residue:1212
BDBM50113480
NameBDBM50113480
Synonyms:CHEMBL3603927 US10584111, Ex No. 5 | US11584732, Example 5
TypeSmall organic molecule
Emp. Form.C15H8ClN5
Mol. Mass.293.711
SMILESClc1cc(cc(c1)-c1cc(ncn1)-c1cccnn1)C#N