Reaction Details
TargetMetabotropic glutamate receptor 5
LigandBDBM372984
Substrate/Competitorn/a
Meas. Tech.[3H]-M-MPEP Radioligand Binding Assay
Ki 4.27±n/a nM
Citation Christopher, JACongreve, MSAves, SJTehan, BG 4-(3-cyanophenyl)-6-pyridinylpyrimidine mGlu5 modulators US Patent US10584111 Publication Date 3/10/2020
 
Metabotropic glutamate receptor 5
Name:Metabotropic glutamate receptor 5
Type:Enzyme
Mol. Mass.:132484.72
Organism:Homo sapiens (Human)
Description:n/a
Residue:1212
BDBM372984
NameBDBM372984
Synonyms:3-[6-(5-fluoropyridin-2- US10584111, Ex No. 25
TypeSmall organic molecule
Emp. Form.C17H11FN4O
Mol. Mass.306.2938
SMILESCOc1cc(cc(c1)-c1cc(ncn1)-c1ccc(F)cn1)C#N