Reaction Details
TargetHistone-lysine N-methyltransferase EZH2
LigandBDBM50246939
Substrate/Competitorn/a
Meas. Tech.Biological Assay (10X SAM)
Ki 0.040±n/a nM
Citation Collins, MRKania, RSKumpf, RAKung, PRichter, DTSutton, SCWythes, MJ Substituted dihydroisoquinolinone compounds US Patent US10570121 Publication Date 2/25/2020
 
Histone-lysine N-methyltransferase EZH2
Name:Histone-lysine N-methyltransferase EZH2
Type:Protein
Mol. Mass.:85367.84
Organism:Homo sapiens (Human)
Description:Q15910
Residue:746
BDBM50246939
NameBDBM50246939
Synonyms:CHEMBL4072089 | US10570121, Example 110
TypeSmall organic molecule
Emp. Form.C26H31Cl2N3O4
Mol. Mass.520.448
SMILESCOC(C1CCN(CC1)C(C)=O)c1cc(Cl)c2CCN(Cc3c(C)cc(C)[nH]c3=O)C(=O)c2c1Cl