Reaction Details
TargetHistone-lysine N-methyltransferase EZH2
LigandBDBM435605
Substrate/Competitorn/a
Meas. Tech.Biological Assay (10X SAM)
Ki 0.300±n/a nM
Citation Collins, MRKania, RSKumpf, RAKung, PRichter, DTSutton, SCWythes, MJ Substituted dihydroisoquinolinone compounds US Patent US10570121 Publication Date 2/25/2020
 
Histone-lysine N-methyltransferase EZH2
Name:Histone-lysine N-methyltransferase EZH2
Type:Protein
Mol. Mass.:85367.84
Organism:Homo sapiens (Human)
Description:Q15910
Residue:746
BDBM435605
NameBDBM435605
Synonyms:US10570121, Example 114 | US10570121, Example 115
TypeSmall organic molecule
Emp. Form.C24H28Cl2N2O4S
Mol. Mass.511.461
SMILESCOC(C1CCS(=O)CC1)c1cc(Cl)c2CCN(Cc3c(C)cc(C)[nH]c3=O)C(=O)c2c1Cl