Reaction Details
TargetHistone-lysine N-methyltransferase EZH2
LigandBDBM50246931
Substrate/Competitorn/a
Meas. Tech.Biological Assay (10X SAM)
Ki 0.400±n/a nM
Citation Collins, MRKania, RSKumpf, RAKung, PRichter, DTSutton, SCWythes, MJ Substituted dihydroisoquinolinone compounds US Patent US10570121 Publication Date 2/25/2020
 
Histone-lysine N-methyltransferase EZH2
Name:Histone-lysine N-methyltransferase EZH2
Type:Protein
Mol. Mass.:85367.84
Organism:Homo sapiens (Human)
Description:Q15910
Residue:746
BDBM50246931
NameBDBM50246931
Synonyms:CHEMBL4065249 | US10570121, Example 117
TypeSmall organic molecule
Emp. Form.C24H28Cl2N2O5S
Mol. Mass.527.461
SMILESCOC(C1CCS(=O)(=O)CC1)c1cc(Cl)c2CCN(Cc3c(C)cc(C)[nH]c3=O)C(=O)c2c1Cl