Reaction Details
TargetHistone-lysine N-methyltransferase EZH2
LigandBDBM435660
Substrate/Competitorn/a
Meas. Tech.Biological Assay (10X SAM)
Ki 0.200±n/a nM
Citation Collins, MRKania, RSKumpf, RAKung, PRichter, DTSutton, SCWythes, MJ Substituted dihydroisoquinolinone compounds US Patent US10570121 Publication Date 2/25/2020
 
Histone-lysine N-methyltransferase EZH2
Name:Histone-lysine N-methyltransferase EZH2
Type:Protein
Mol. Mass.:85367.84
Organism:Homo sapiens (Human)
Description:Q15910
Residue:746
BDBM435660
NameBDBM435660
Synonyms:US10570121, Example 166 | US10570121, Example 167
TypeSmall organic molecule
Emp. Form.C24H29Cl2N3O3
Mol. Mass.478.411
SMILESCOC(C1CCNCC1)c1cc(Cl)c2CCN(Cc3c(C)cc(C)[nH]c3=O)C(=O)c2c1Cl