Reaction Details
TargetHistone-lysine N-methyltransferase EZH2
LigandBDBM435662
Substrate/Competitorn/a
Meas. Tech.Biological Assay (10X SAM)
Ki 0.700±n/a nM
Citation Collins, MRKania, RSKumpf, RAKung, PRichter, DTSutton, SCWythes, MJ Substituted dihydroisoquinolinone compounds US Patent US10570121 Publication Date 2/25/2020
 
Histone-lysine N-methyltransferase EZH2
Name:Histone-lysine N-methyltransferase EZH2
Type:Protein
Mol. Mass.:85367.84
Organism:Homo sapiens (Human)
Description:Q15910
Residue:746
BDBM435662
NameBDBM435662
Synonyms:US10570121, Example 168 | US10570121, Example 169
TypeSmall organic molecule
Emp. Form.C27H34ClN3O5
Mol. Mass.516.029
SMILESCOC(C1CCN(CC1)C(=O)CO)c1cc(C)c2CCN(Cc3c(C)cc(C)[nH]c3=O)C(=O)c2c1Cl