Reaction Details
TargetHistone-lysine N-methyltransferase EZH2
LigandBDBM435668
Substrate/Competitorn/a
Meas. Tech.Biological Assay (10X SAM)
Ki 0.600±n/a nM
Citation Collins, MRKania, RSKumpf, RAKung, PRichter, DTSutton, SCWythes, MJ Substituted dihydroisoquinolinone compounds US Patent US10570121 Publication Date 2/25/2020
 
Histone-lysine N-methyltransferase EZH2
Name:Histone-lysine N-methyltransferase EZH2
Type:Protein
Mol. Mass.:85367.84
Organism:Homo sapiens (Human)
Description:Q15910
Residue:746
BDBM435668
NameBDBM435668
Synonyms:US10570121, Example 174 | US10570121, Example 175
TypeSmall organic molecule
Emp. Form.C23H27Cl2N3O3
Mol. Mass.464.385
SMILESCOC(C1CN(C)C1)c1cc(Cl)c2CCN(Cc3c(C)cc(C)[nH]c3=O)C(=O)c2c1Cl