Reaction Details
TargetHistone-lysine N-methyltransferase EZH2
LigandBDBM435677
Substrate/Competitorn/a
Meas. Tech.Biological Assay (10X SAM)
Ki 0.600±n/a nM
Citation Collins, MRKania, RSKumpf, RAKung, PRichter, DTSutton, SCWythes, MJ Substituted dihydroisoquinolinone compounds US Patent US10570121 Publication Date 2/25/2020
 
Histone-lysine N-methyltransferase EZH2
Name:Histone-lysine N-methyltransferase EZH2
Type:Protein
Mol. Mass.:85367.84
Organism:Homo sapiens (Human)
Description:Q15910
Residue:746
BDBM435677
NameBDBM435677
Synonyms:US10570121, Example 183 | US10570121, Example 184
TypeSmall organic molecule
Emp. Form.C24H27Cl2N3O4
Mol. Mass.492.395
SMILESCC(C1CN(C1)C(=O)CO)c1cc(Cl)c2CCN(Cc3c(C)cc(C)[nH]c3=O)C(=O)c2c1Cl