Reaction Details
TargetCannabinoid receptor 2
LigandBDBM295694
Substrate/Competitorn/a
Meas. Tech.In Vitro Assay
EC50 0.270±n/a nM
Citation Riether, DBinder, FPDoods, HMueller, SGNicholson, JRSauer, A (Cyano-dimethyl-methyl)-isoxazoles and -[1,3,4]thiadiazoles US Patent US10570125 Publication Date 2/25/2020
 
Cannabinoid receptor 2
Name:Cannabinoid receptor 2
Type:G Protein-Coupled Receptor (GPCR)
Mol. Mass.:39690.94
Organism:Homo sapiens (Human)
Description:P34972
Residue:360
BDBM295694
NameBDBM295694
Synonyms:Example 46 in WO2010147792 US11084810, Example 46 in WO2010147792 | US11725004, Example 46 in WO2010147792
TypeSmall organic molecule
Emp. Form.C19H33N3O4
Mol. Mass.367.483
SMILESCOCC(C)(C)c1cc(NC(=O)C(C)(C)N(C)CC2CCOCC2)on1