Reaction Details
TargetMetabotropic glutamate receptor 5
LigandBDBM393885
Substrate/Competitorn/a
Meas. Tech.In Vitro GIRK Thallium Flux (2.5 minute) Assay
EC50 40.0±n/a nM
Citation Cosford, NDRaveendra-Panickar, DSheffler, DJHutchinson, JHGadient, RA Metabotropic glutamate receptor negative allosteric modulators (NAMs) and uses thereof US Patent US10597367 Publication Date 3/24/2020
 
Metabotropic glutamate receptor 5
Name:Metabotropic glutamate receptor 5
Type:Enzyme
Mol. Mass.:131900.14
Organism:Rattus norvegicus (Rat)
Description:P31424
Residue:1203
BDBM393885
NameBDBM393885
Synonyms:US10597367, Example 182 | US9969726, Example 182
TypeSmall organic molecule
Emp. Form.C15H9BrN4O
Mol. Mass.341.162
SMILESBrc1ccc2N=C(CC(=O)Nc2c1)c1ccnc(c1)C#N