Reaction Details
TargetBeta-secretase 1
LigandBDBM230869
Substrate/Competitorn/a
Meas. Tech.Binding Assay
Ki 6.70±n/a nM
Citation Juhl, KTagmose, LMarigo, M 2-amino-6-(difluoromethyl)-5,5-difluoro-6-phenyl-3,4,5,6-tetrahydropyridines as BACE1 inhibitors US Patent US10603310 Publication Date 3/31/2020
 
Beta-secretase 1
Name:Beta-secretase 1
Type:Protein
Mol. Mass.:55755.10
Organism:Homo sapiens (Human)
Description:P56817
Residue:501
BDBM230869
NameBDBM230869
Synonyms:US10045974, 13 US9346797, 13 | US9346797, 5
TypeSmall organic molecule
Emp. Form.C19H17F5N4O2
Mol. Mass.428.3559
SMILESCOc1ccc(nc1)C(=O)Nc1ccc(F)c(c1)[C@]1(N=C(N)CCC1(F)F)C(F)F