Reaction Details
TargetRAC-alpha serine/threonine-protein kinase
LigandBDBM50427331
Substrate/Competitorn/a
Meas. Tech.In Vitro Kinase Assay
IC50 3.90±n/a nM
Citation Johnson, PDLeach, ALuke, RWMatusiak, ZSMorris, JJ Protein kinase B inhibitors US Patent US10654855 Publication Date 5/19/2020
 
RAC-alpha serine/threonine-protein kinase
Name:RAC-alpha serine/threonine-protein kinase
Type:Enzyme
Mol. Mass.:55681.25
Organism:Homo sapiens (Human)
Description:P31749
Residue:480
BDBM50427331
NameBDBM50427331
Synonyms:CHEMBL2325728 US11236095, Example 55 | US9492453, 55
TypeSmall organic molecule
Emp. Form.C25H32ClN7O
Mol. Mass.482.021
SMILESNC1(CCN(CC1)c1ncnc2[nH]ccc12)C(=O)N[C@@H](CCN1CCCC1)c1ccc(Cl)cc1