Reaction Details
TargetMonoacylglycerol lipase ABHD6
LigandBDBM444468
Substrate/Competitorn/a
Meas. Tech.Fluorescent Assay
IC50 55±n/a nM
Citation Makriyannis, AMalamas, MLamani, MFarah, SI ABHD6 and dual ABHD6/MGL inhibitors and their uses US Patent US10662159 Publication Date 5/26/2020
 
Monoacylglycerol lipase ABHD6
Name:Monoacylglycerol lipase ABHD6
Type:PROTEIN
Mol. Mass.:38341.83
Organism:Homo sapiens (Human)
Description:ChEMBL_105457
Residue:337
BDBM444468
NameBDBM444468
Synonyms:US10662159, Example 58
TypeSmall organic molecule
Emp. Form.C17H16F7NO3
Mol. Mass.415.3027
SMILESFc1cccc(OC2C[C@@]3(C2)CCN(C3)C(=O)OC(C(F)(F)F)C(F)(F)F)c1