Reaction Details
TargetBromodomain-containing protein 4
LigandBDBM298346
Substrate/Competitorn/a
Meas. Tech.BROMOscan Binding Assay
Kd 1300±n/a nM
Citation Landau, SBKagey, M Bromodomain inhibitors US Patent US10124009 Publication Date 11/13/2018
 
Bromodomain-containing protein 4
Name:Bromodomain-containing protein 4
Type:Protein
Mol. Mass.:152264.84
Organism:Homo sapiens (Human)
Description:O60885
Residue:1362
BDBM298346
NameBDBM298346
Synonyms:US10124009, Compound 1
TypeSmall organic molecule
Emp. Form.C25H27ClN4O3S
Mol. Mass.499.025
SMILESCc1sc-2c(c1C)C(=N[C@@H](CC(=O)OC1CCC(O)CC1)c1nnc(C)n-21)c1ccc(Cl)cc1