Reaction Details
TargetIsoform C of Bromodomain-containing protein 4 (Short)
LigandBDBM298349
Substrate/Competitorn/a
Kd 1300±n/a nM
Citation Landau, SBKagey, M Bromodomain inhibitors US Patent US10124009 Publication Date 11/13/2018
 
Isoform C of Bromodomain-containing protein 4 (Short)
Name:Isoform C of Bromodomain-containing protein 4 (Short)
Type:n/a
Mol. Mass.:80477.46
Organism:Homo sapiens (Human)
Description:O60885-2
Residue:722
BDBM298349
NameBDBM298349
Synonyms:US10124009, Compound 4
TypeSmall organic molecule
Emp. Form.C22H23ClN4O3S
Mol. Mass.458.961
SMILESCc1sc-2c(c1C)C(=N[C@@H](CC(=O)OCCCO)c1nnc(C)n-21)c1ccc(Cl)cc1