Reaction Details
TargetD(2) dopamine receptor
LigandBDBM194798
Substrate/Competitorn/a
Meas. Tech.Receptor Binding Assay
Ki 1.20±n/a nM
Citation Yamashita, HIto, NMiyamura, SOshima, KMatsubara, JKuroda, HTakahashi, HShimizu, STanaka, TOshiro, YTaira, S Piperazine-substituted benzothiophenes for treatment of mental disorders US Patent US Patent
 
D(2) dopamine receptor
Name:D(2) dopamine receptor
Type:G Protein-Coupled Receptor (GPCR)
Mol. Mass.:50931.60
Organism:Rattus norvegicus (rat)
Description:P61169
Residue:444
BDBM194798
NameBDBM194798
Synonyms:US9206167, 19 | USRE48059, Compound of Example 19
TypeSmall organic molecule
Emp. Form.C24H27N3O2S
Mol. Mass.421.555
SMILESO=C1CCc2cc(OCCCN3CCN(CC3)c3cccc4sccc34)ccc2N1