Reaction Details
Target5-hydroxytryptamine receptor 2A
LigandBDBM194798
Substrate/Competitorn/a
Meas. Tech.Receptor Binding Assay
Ki 1.20±n/a nM
Citation Yamashita, HIto, NMiyamura, SOshima, KMatsubara, JKuroda, HTakahashi, HShimizu, STanaka, TOshiro, YTaira, S Piperazine-substituted benzothiophenes for treatment of mental disorders US Patent US Patent
 
5-hydroxytryptamine receptor 2A
Name:5-hydroxytryptamine receptor 2A
Type:G Protein-Coupled Receptor (GPCR)
Mol. Mass.:52852.05
Organism:Rattus norvegicus (rat)
Description:Rat cortex membranes 5-HT2A receptors.
Residue:471
BDBM194798
NameBDBM194798
Synonyms:US9206167, 19 | USRE48059, Compound of Example 19
TypeSmall organic molecule
Emp. Form.C24H27N3O2S
Mol. Mass.421.555
SMILESO=C1CCc2cc(OCCCN3CCN(CC3)c3cccc4sccc34)ccc2N1