Reaction Details
TargetPhosphatidylinositol 4,5-bisphosphate 3-kinase catalytic subunit delta isoform
LigandBDBM50192886
Substrate/Competitorn/a
Meas. Tech.PI3K-delta Selective Assay
IC50 4000±n/a nM
Citation Kutok, JLWinkler, DGPalombella, VJ Heterocyclic compounds and uses thereof US Patent US10675286 Publication Date 6/9/2020
 
Phosphatidylinositol 4,5-bisphosphate 3-kinase catalytic subunit delta isoform
Name:Phosphatidylinositol 4,5-bisphosphate 3-kinase catalytic subunit delta isoform
Type:Enzyme Subunit
Mol. Mass.:119489.41
Organism:Homo sapiens (Human)
Description:O00329
Residue:1044
BDBM50192886
NameBDBM50192886
Synonyms:CHEMBL3946030 US10675286, Compound 70 | US9775844, Compound 70
TypeSmall organic molecule
Emp. Form.C27H24N6O2
Mol. Mass.464.5185
SMILESC\C=C\c1cccc2cc([C@H](C)NC(=O)c3c(N)nn4cccnc34)n(-c3ccccc3)c(=O)c12