Reaction Details
TargetN-formyl peptide receptor 2
LigandBDBM450267
Substrate/Competitorn/a
Meas. Tech.FPR2 and FPR1 Cyclic Adenosine Monophosphate (cAMP) Assays
EC50 0.220±n/a nM
Citation Shirude, PSBaligar, VSeshadri, BChattopadhyay, AKWurtz, NRKick, EK Phenylpyrrolidinone formyl peptide 2 receptor agonists US Patent US10676431 Publication Date 6/9/2020
 
N-formyl peptide receptor 2
Name:N-formyl peptide receptor 2
Type:G Protein-Coupled Receptor (GPCR)
Mol. Mass.:38968.35
Organism:Homo sapiens (Human)
Description:P25090
Residue:351
BDBM450267
NameBDBM450267
Synonyms:US10676431, Example 30 | US11117861, Example 30
TypeSmall organic molecule
Emp. Form.C27H26ClF3N3O4P
Mol. Mass.579.935
SMILESCOC[C@@H]1C[C@@H](NC(=O)Nc2ccc(Cl)cc2F)C(=O)N1c1ccc(c(F)c1F)-c1ccccc1P(C)(C)=O