Reaction Details
TargetSphingosine 1-phosphate receptor 1
LigandBDBM313177
Substrate/Competitorn/a
Meas. Tech.Binding Assay
IC50 5.20±n/a nM
Citation Dyckman, AJDhar, TGXiao, HGilmore, JLYang, MGXiao, ZMarcoux, D Substituted bicyclic compounds US Patent US10709719 Publication Date 7/14/2020
 
Sphingosine 1-phosphate receptor 1
Name:Sphingosine 1-phosphate receptor 1
Type:Enzyme
Mol. Mass.:42836.02
Organism:Homo sapiens (Human)
Description:P21453
Residue:382
BDBM313177
NameBDBM313177
Synonyms:US10166249, Example 693 US11058696, Example 693 | US11701373, Example 693
TypeSmall organic molecule
Emp. Form.C25H34NO5P
Mol. Mass.459.5149
SMILESCOc1cccc(CCC2CCc3cc(ccc3C2)[C@H]2CC[C@](N)(COP(O)(O)=O)C2)c1