Reaction Details
TargetTransient receptor potential cation channel subfamily A member 1
LigandBDBM452523
Substrate/Competitorn/a
Meas. Tech.FLIPR Assay (90 minutes)
IC50 0.880±n/a nM
Citation Terrett, JAChen, HConstantineau-Forget, LLarouche-Gauthier, RLépissier, LBeaumier, FDéry, MGrand-Maître, CSturino, CVolgraf, MVillemure, E Oxadiazole transient receptor potential channel inhibitors US Patent US10710994 Publication Date 7/14/2020
 
Transient receptor potential cation channel subfamily A member 1
Name:Transient receptor potential cation channel subfamily A member 1
Type:Protein
Mol. Mass.:127514.20
Organism:Homo sapiens (Human)
Description:O75762
Residue:1119
BDBM452523
NameBDBM452523
Synonyms:1-((3-((3R,5R)-5-(4- chlorophenyl)tetrahydro- furan-3-yl)-1,2,4- oxadiazol-5-yl)methyl)- 7-methyl-1,7-dihydro- 6H-purin-6-one US10710994, Example 132 US10710994, Example 6 | US10710994, Example 70
TypeSmall organic molecule
Emp. Form.C19H17ClN6O3
Mol. Mass.412.83
SMILESCn1cnc2ncn(Cc3nc(no3)[C@@H]3CO[C@H](C3)c3ccc(Cl)cc3)c(=O)c12