Reaction Details
TargetN-formyl peptide receptor 2
LigandBDBM454206
Substrate/Competitorn/a
Meas. Tech.cAMP Assay
EC50 0.280±n/a nM
Citation Wurtz, NRShirude, PS Piperidinone formyl peptide 2 receptor and formyl peptide 1 receptor agonists US Patent US10717708 Publication Date 7/21/2020
 
N-formyl peptide receptor 2
Name:N-formyl peptide receptor 2
Type:G Protein-Coupled Receptor (GPCR)
Mol. Mass.:38968.35
Organism:Homo sapiens (Human)
Description:P25090
Residue:351
BDBM454206
NameBDBM454206
Synonyms:US10717708, Example 199 US11530183, Example 199
TypeSmall organic molecule
Emp. Form.C26H28N4O5S
Mol. Mass.508.589
SMILESCOc1ccc(NC(=O)N[C@@H]2CCCN(C2=O)c2ccc(cc2)-c2ccccc2NS(C)(=O)=O)cc1